{"text_format":"3","workbook":"xlsx","n_sheets":6,"sheets":["Zad__1 - zest hydrof Wilo","Zad__2 - zest hydr Grundfos","Zad__3 - Przep Wilo","Zad__4 - Przep Grundfos","MPK","Zad__5 - Przep ECOL-UNICON"],"not_rendered":{"external_links":1,"defined_names":10},"read":"whole","date_system":"1900"}

{"sheet":"Zad__1 - zest hydrof Wilo","index":0,"n_rows":20,"n_cols":12,"rows_kept":20,"merged":[[0,10,0,11],[2,0,2,11],[3,0,3,11],[5,0,6,0],[5,1,6,1],[5,2,6,2],[5,3,6,4],[12,9,12,10],[13,1,13,6],[14,1,14,6],[16,1,16,6],[18,8,18,11],[19,8,21,11]]}
[null,"ZZP.260.2.15.2023",{"$nulls":8},"Załącznik nr 3.1"]
[]
["Wykonanie przeglądów serwisowych hydroforowych zestawów pompowych i przepompowni ścieków w obiektach MOSiR w latach 2022-2025"]
[]
[null,"Kosztorys ofertowy"]
["L.p.","Nazwa / typ\nUkładu / urządzenia","Producent","Lokalizacja",null,"Status urządzenia","Harmonogram1)","j.m.","Ilość","Częstotliwość usługi w okresie Umowy 2)","Cena jednostkowa brutto","Wartość brutto [zł]"]
[{"$nulls":8},"a","b","c","a*b*c"]
["1","2","3","4","5","6","7","8","9","10","11","12"]
["1.","Hydroforowy zestaw pompowy:\nCOR-2 MVIE 403-2G/VR-WMS.-EB nr fabr.: A/50316000-2","Wilo","AQUA Lublin\nAl. Zygmuntowskie 4\n","podbasenie\n- kondygnacja -1\n (w tym samym pomiwszczniu co COR-4)","po gwarancji","1 - grudzień 2023\n2 - grudzień 2024\n3 - grudzień 2025","szt.",1,3]
["2.","Hydroforowy zestaw pompowy:\nCOR-4 MVIE 803-2G/VR-WMS.-EB nr fabr.: A/50313594-1","Wilo","\nAQUA Lublin\nAl. Zygmuntowskie 4\n","podbasenie\n- kondygnacja: -1\n(w tym samym pomiwszczniu co COR-3)","po gwarancji","1 - grudzień 2023\n2 - grudzień 2024\n3 - grudzień 2025","szt.",1,3]
["3.","Hydroforowy zestaw pompowy:\nCOR 4 Helix VE1006/VR-WMS;2017w47;S/N 418/11/17;nr kat.2863822","Wilo","ul. Kazimierza Wielkiego 8,\nHala GLOBUS","Wydzielone pomieszczenie w budynku technicznym\n- kondygnacja: parter","po gwarancji","1 - czerwiec 2023\n2 - czerwiec 2024\n3 - czerwiec 2025","szt.",1,3]
["4.","Hydroforowy zestaw pompowy:\nCOR-3 MVIE 806-2G/VR-P nr fabr.: 076/03/13","Wilo","ul. Łabędzia 4\nCentrum Sportowo-Rekreacyjne ŁABĘDZIA","podbasenie (wydzielone pomieszczenie)\n- kondygnacja: -1","po gwarancji","1 - grudzień 2023\n2 - grudzień 2024\n3 - grudzień 2025","szt.",1,3]
[{"$nulls":9},"RAZEM BRUTTO:"]
[null,"1) TERMIN WYKONANIA USŁUGI:"]
[null,"   - maksymalny ustalony wg terminu poprzedniego serwisu – należy wykonać nie później niż podana data i wcześniej niż 14 dni przed, chyba że   uzgodniono inaczej z Zamawiającym."]
[null,"2) częstotliwość usług w zakresie umowy:"]
[null,"   - w tym przeglądy dodatkowe"]
[]
[{"$nulls":8},"…....................................…….............................."]
[{"$nulls":8},"(Podpis i pieczęć imienna osób uprawnionych do składania oświadczeń woli Wykonawcy)"]

{"sheet":"Zad__2 - zest hydr Grundfos","index":1,"n_rows":18,"n_cols":12,"rows_kept":18,"merged":[[0,10,0,11],[2,0,2,11],[3,0,3,11],[5,0,6,0],[5,1,6,1],[5,2,6,2],[5,3,6,4],[10,9,10,10],[11,1,11,6],[12,1,12,6],[14,1,14,6],[16,8,16,11],[17,8,19,11]]}
[null,"ZZP.260.2.15.2023",{"$nulls":8},"Załącznik nr 3.2"]
[]
["Wykonanie przeglądów serwisowych hydroforowych zestawów pompowych i przepompowni ścieków w obiektach MOSiR w latach 2022-2025"]
[]
[null,"Kosztorys ofertowy"]
["L.p.","Nazwa / typ\nUkładu / urządzenia","Producent","Lokalizacja",null,"Status urządzenia","Harmonogram1)","j.m.","Ilość","Częstotliwość usługi w okresie Umowy 2)","Cena jednostkowa brutto","Wartość brutto [zł]"]
[{"$nulls":8},"a","b","c","a*b*c"]
["1","2","3","4","5","6","7","8","9","10","11","12"]
["1.","Hydroforowy zestaw pompowy:\nHydro MPC-E 3 CRIE 15-1","Grundfos","ul. Stadionowa 1\nArena Lublin","Hydrofornia nr 1 i nr 2 – budynek stadionu - poziom „0”","po gwarancji","1 – wrzesień 2023\n2 – wrzesień 2024\n3 – wrzesień 2025","szt.",2,3]
["2.","Hydroforowy zestaw pompowy:\nHydro MPC-E 4 CRIE- 5-12 ","Grundfos","ul. Stadionowa 1\nArena Lublin","Hydrofornia podziemna – tereny zielone przy stadionie","po gwarancji","1 – wrzesień 2023\n2 – wrzesień 2024\n3 – wrzesień 2025","szt.",1,3]
[{"$nulls":9},"RAZEM BRUTTO:"]
[null,"1) TERMIN WYKONANIA USŁUGI:"]
[null,"   - maksymalny ustalony wg terminu poprzedniego serwisu – należy wykonać nie później niż podana data i wcześniej niż 14 dni przed, chyba że   uzgodniono inaczej z Zamawiającym."]
[null,"2) częstotliwość usług w zakresie umowy:"]
[null,"   - w tym przeglądy dodatkowe"]
[]
[{"$nulls":8},"…....................................…….............................."]
[{"$nulls":8},"(Podpis i pieczęć imienna osób uprawnionych do składania oświadczeń woli Wykonawcy)"]

{"sheet":"Zad__3 - Przep Wilo","index":2,"n_rows":22,"n_cols":12,"rows_kept":22,"merged":[[0,10,0,11],[2,0,2,11],[3,0,3,11],[5,0,6,0],[5,1,6,1],[5,2,6,2],[5,3,6,4],[14,9,14,10],[15,1,15,6],[16,1,16,6],[18,1,18,6],[20,8,20,11],[21,8,23,11]]}
[null,"ZZP.260.2.15.2023",{"$nulls":8},"Załącznik nr 3.3"]
[]
["Wykonanie przeglądów serwisowych hydroforowych zestawów pompowych i przepompowni ścieków w obiektach MOSiR w latach 2022-2025"]
[]
[null,"Kosztorys ofertowy"]
["L.p.","Nazwa / typ\nUkładu / urządzenia","Producent","Lokalizacja",null,"Status urządzenia","Harmonogram1)","j.m.","Ilość","Częstotliwość usługi w okresie Umowy 2)","Cena jednostkowa brutto","Wartość brutto [zł]"]
[{"$nulls":8},"a","b","c","a*b*c"]
["1","2","3","4","5","6","7","8","9","10","11","12"]
["1.","Przepompownia ścieków deszczowych PD1\nZbiornik żelbetowy: 5,0x5,0x3,96m \nGłębokość (wysokość od terenu do dna zbiornika) 8;0 [m]\nPompy:\nTyp: REXA PRO C10DA-516 - szt. 2\nnr ser. 650309220, 650309221\nSzafa sterownicza:\nNr ser. RZS/11/05/17/P\n036/DS./09/2016/START LUBLIN PD1","Wilo","Stadion Miejski (Żużlowy)\n\nAl. Zygmuntowskie 5\n","Wjazd główą bramą,\nna końcu drogi pożarowej.\nPlac przy wjeździe na tor od strony rzeki","po gwarancji","1 - styczeń 2024\n2 - grudzień 2024\n3 – grudzień 2025","kpl",1,3]
["1.","+ wymiana ojelu w pompach ",{"$nulls":4},"1 - styczeń 2024\n2 - grudzień 2025","kpl",1,2]
["2.","Przepompownia ścieków deszczowych PD2 \nZbiornik żelbetowy: 14,065,0x2,5m \nGłębokość (wysokość od terenu do dna zbiornika)5,3 [m]\nPompy:\nTyp: REXA PRO C10DA-516 - szt. 2\nnr ser. SS LUB PIŁ22, SS LUB PIŁ22 1\nSzafa sterownicza:\nNr ser. RZS/11/05/17/P0\n037/DS./09/2016/START LUBLIN PD2","Wilo","Stadion Lekkoatletyczny (Start)\n\nAl. Piłsudskiego 22\n","Wjazd główą bramą,\nna końcu drogi pożarowej.\nPrzy murze rozgraniczającym stadiony","po gwarancji","1 - styczeń 2024\n2 - grudzień 2024\n3 - grudzień 2025","kpl",1,3]
["2.","+ wymiana ojelu w pompach ",{"$nulls":4},"1 - styczeń 2024\n2 - grudzień 2025","kpl",1,2]
["3.","Przepompownia ścieków sanitarnych PS\nPompy:\nTyp: PRO REXA V06 DA-623 - szt. 2\nnr ser. 650302669, 650302670\nSzafa sterownicza:\nNr ser. RZS/10/05/17/SP\n035/DS./09/2016/START LUBLIN PS","Wilo","Stadion Lekkoatletyczny (Start)\n\nAl. Piłsudskiego 22\n","Wjazd główą bramą,\npo lewej stronie przy ogrodzeniu od Al.. Pisudskiego 22","po gwarancji","1 - styczeń 2024\n2 - grudzień 2024\n3 - grudzień 2025","kpl.",1,3]
["3.","+ wymiana ojelu w pompach ",{"$nulls":4},"1 - styczeń 2024\n2 - grudzień 2025","kpl",1,2]
[{"$nulls":9},"RAZEM BRUTTO:"]
[null,"1) TERMIN WYKONANIA USŁUGI:"]
[null,"   - maksymalny ustalony wg terminu poprzedniego serwisu – należy wykonać nie później niż podana data i wcześniej niż 14 dni przed, chyba że   uzgodniono inaczej z Zamawiającym."]
[null,"2) częstotliwość usług w zakresie umowy:"]
[null,"   - w tym przeglądy dodatkowe"]
[]
[{"$nulls":8},"…....................................…….............................."]
[{"$nulls":8},"(Podpis i pieczęć imienna osób uprawnionych do składania oświadczeń woli Wykonawcy)"]

{"sheet":"Zad__4 - Przep Grundfos","index":3,"n_rows":20,"n_cols":12,"rows_kept":20,"merged":[[0,10,0,11],[2,0,2,11],[3,0,3,11],[5,0,6,0],[5,1,6,1],[5,2,6,2],[5,3,6,4],[12,9,12,10],[13,1,13,6],[14,1,14,6],[16,1,16,6],[18,8,18,11],[19,8,21,11]]}
[null,"ZZP.260.2.15.2023",{"$nulls":8},"Załącznik nr 3.4"]
[]
["Wykonanie przeglądów serwisowych hydroforowych zestawów pompowych i przepompowni ścieków w obiektach MOSiR w latach 2022-2025"]
[]
[null,"Kosztorys ofertowy"]
["L.p.","Nazwa / typ\nUkładu / urządzenia","Producent","Lokalizacja",null,"Status urządzenia","Harmonogram1)","j.m.","Ilość","Częstotliwość usługi w okresie Umowy 2)","Cena jednostkowa brutto","Wartość brutto [zł]"]
[{"$nulls":8},"a","b","c","a*b*c"]
["1","2","3","4","5","6","7","8","9","10","11","12"]
["1.","Pompownia EPS-PD\n- pompa zatapialna Grundfos SE1.100.100.40.4.51D – 3 szt.\n- sonda hydrostatyczna SG 25S – 1 szt.\n- wyłączniki pływakowe – 3 szt.\n- szafa sterownicza – 1 szt.","Grundfos","ul. Stadionowa 1\nArena Lublin","Pompownia wód deszczowych – tereny zielone przy stadionie","po gwarancji","1 - wrzesień 2023\n2 - wrzesień 2024\n3 – wrzesień 2025","kpl",1,3]
["1.","+ wymiana ojelu w pompach ",{"$nulls":4},"1 - wrzesień 2023\n2 - wrzesień 2024\n3 – wrzesień 2025","kpl",1,3]
["2.","Pompownia wody deszczowej z odwodnienia dachu \n- pompa zatapialna Grundfos SE1.80.80.40.A.4.51D.B.Z – 1 szt.\n\t- wyłączniki pływakowe – 1 szt.","Grundfos","ul. Stadionowa 1\nArena Lublin","Pompownia wód retencyjnych – tereny zielone przy stadionie","po gwarancji","1 - wrzesień 2023\n2 - wrzesień 2024\n3 – wrzesień 2025","szt.",1,3]
["2.","+ wymiana ojelu w pompach ",{"$nulls":4},"1 - wrzesień 2023\n2 - wrzesień 2024\n3 – wrzesień 2025","kpl",1,3]
[{"$nulls":9},"RAZEM BRUTTO:"]
[null,"1) TERMIN WYKONANIA USŁUGI:"]
[null,"   - maksymalny ustalony wg terminu poprzedniego serwisu – należy wykonać nie później niż podana data i wcześniej niż 14 dni przed, chyba że   uzgodniono inaczej z Zamawiającym."]
[null,"2) częstotliwość usług w zakresie umowy:"]
[null,"   - w tym przeglądy dodatkowe"]
[]
[{"$nulls":8},"…....................................…….............................."]
[{"$nulls":8},"(Podpis i pieczęć imienna osób uprawnionych do składania oświadczeń woli Wykonawcy)"]

{"sheet":"MPK","index":4,"n_rows":71,"n_cols":14,"rows_kept":71,"hidden":true}
[]
[null,"Kwota na okres 2 lat – budżet 2023:",{"$f":"SUM(C3:C4)","v":{"$error":"#VALUE!"}},{"$f":"SUM(D3:D4)","v":{"$error":"#VALUE!"}},{"$f":"SUM(E3:E4)","v":{"$error":"#VALUE!"}},{"$f":"SUM(F3:F4)","v":{"$error":"#VALUE!"}},{"$f":"SUM(C2:F2)","v":{"$error":"#VALUE!"}},{"$f":"G2-'[1]Formularz cenowy'!E17","v":{"$error":"#VALUE!"}},{"$f":"'[1]Zestawienie ilościowe i harmono'!Z10-G2","v":{"$error":"#VALUE!"}}]
[null,"Kwota na okres 1 roku – budżet 2023:",{"$f":"SUM(C13:C31)","v":{"$error":"#VALUE!"}},{"$f":"SUM(D13:D31)","v":{"$error":"#VALUE!"}},{"$f":"SUM(E13:E31)","v":{"$error":"#VALUE!"}},{"$f":"SUM(F13:F31)","v":{"$error":"#VALUE!"}},{"$f":"SUM(C3:F3)","v":{"$error":"#VALUE!"}}]
[null,"Kwota na okres 1 roku – budżet 2024:",{"$f":"SUM(C33:C51)","v":{"$error":"#VALUE!"}},{"$f":"SUM(D33:D51)","v":{"$error":"#VALUE!"}},{"$f":"SUM(E33:E51)","v":{"$error":"#VALUE!"}},{"$f":"SUM(F33:F51)","v":{"$error":"#VALUE!"}},{"$f":"SUM(C4:F4)","v":{"$error":"#VALUE!"}}]
[null,"Kwota na okres 1 roku – budżet 2025:",{"$f":"SUM(C53:C71)","v":{"$error":"#VALUE!"}},{"$f":"SUM(D53:D71)","v":{"$error":"#VALUE!"}},{"$f":"SUM(E53:E71)","v":{"$error":"#VALUE!"}},{"$f":"SUM(F53:F71)","v":{"$error":"#VALUE!"}},{"$f":"SUM(C5:F5)","v":{"$error":"#VALUE!"}}]
[]
[null,null,"Dział","Dział ","Dział ","Dział "]
[null,null," MBS","MWR","MHS","AOG (Berlin)"]
["Nr MPK","Nazwa MPK",{"$f":"'[1]Zestawienie ilościowe i harmono'!W30","v":"Maciej Wątróbka"},"\nJarosław Kamiński",{"$f":"'[1]Zestawienie ilościowe i harmono'!W12","v":"Izabela Czernicka-Białowąs"},"\nEdyta Danielczuk","ŁĄCZNIE"]
[null,"SUMA:",{"$f":"SUM(C13:C51)","v":{"$error":"#VALUE!"}},{"$f":"SUM(D13:D51)","v":{"$error":"#VALUE!"}},{"$f":"SUM(E13:E51)","v":{"$error":"#VALUE!"}},{"$f":"SUM(F13:F51)","v":{"$error":"#VALUE!"}},{"$f":"SUM(G13:G51)","v":{"$error":"#VALUE!"}}]
[null,"Pozostało:",{"$f":"C2-SUM(C13:C51)","v":{"$error":"#VALUE!"}},{"$f":"D2-SUM(D13:D51)","v":{"$error":"#VALUE!"}},{"$f":"E2-SUM(E13:E51)","v":{"$error":"#VALUE!"}},{"$f":"F2-SUM(F13:F51)","v":{"$error":"#VALUE!"}},{"$f":"G2-SUM(G13:G51)","v":{"$error":"#VALUE!"}}]
[2023,null,1,2,3,4,1]
[101,{"$f":"VLOOKUP($A13,'[1]MPK-2023'!$A$3:$F$104,2,0)","v":"Zygmuntowskie - hala im. Z. Niedzieli"},null,null,{"$f":"SUMIF('[1]Zestawienie ilościowe i harmono'!$X$12:$X$30,[1]MPKi!$A12,'[1]Zestawienie ilościowe i harmono'!$Z$12:$Z$30)","v":{"$error":"#VALUE!"}},null,{"$f":"SUM(C13:F13)","v":{"$error":"#VALUE!"}},null,{"$f":"VLOOKUP(A13,'[1]Zestawienie ilościowe i harmono'!$X$12:$AJ$30,3,0)","v":381.27000000000004},{"$f":"G13-I13","v":{"$error":"#VALUE!"}},{"$f":"SUMIF('[1]Zestawienie ilościowe i harmono'!$X$12:$X$30,[1]MPKi!$A12,'[1]Zestawienie ilościowe i harmono'!$Z$12:$Z$30)","v":{"$error":"#VALUE!"}},{"$f":"IF('[1]Zestawienie ilościowe i harmono'!U12=[1]MPKi!C$7,[1]MPKi!J12,0)","v":0},null,101]
[104,{"$f":"VLOOKUP($A14,'[1]MPK-2023'!$A$3:$F$104,2,0)","v":"Zygmuntowskie - biura - pod wynajem"},null,null,{"$f":"SUMIF('[1]Zestawienie ilościowe i harmono'!$X$12:$X$30,[1]MPKi!$A13,'[1]Zestawienie ilościowe i harmono'!$Z$12:$Z$30)","v":{"$error":"#VALUE!"}},null,{"$error":"#VALUE!"},null,{"$f":"VLOOKUP(A14,'[1]Zestawienie ilościowe i harmono'!$X$12:$AJ$30,3,0)","v":215.92000000000002},{"$error":"#VALUE!"},{"$f":"SUMIF('[1]Zestawienie ilościowe i harmono'!$X$12:$X$30,[1]MPKi!$A13,'[1]Zestawienie ilościowe i harmono'!$Z$12:$Z$30)","v":{"$error":"#VALUE!"}},{"$f":"IF('[1]Zestawienie ilościowe i harmono'!U13=[1]MPKi!C$7,[1]MPKi!J13,0)","v":0},null,110]
[110,{"$f":"VLOOKUP($A15,'[1]MPK-2023'!$A$3:$F$104,2,0)","v":"Zygmuntowskie - pływalnia ( H2O)"},null,{"$f":"SUMIF('[1]Zestawienie ilościowe i harmono'!$X$12:$X$30,[1]MPKi!$A14,'[1]Zestawienie ilościowe i harmono'!$Z$12:$Z$30)","v":{"$error":"#VALUE!"}},null,null,{"$error":"#VALUE!"},null,{"$f":"VLOOKUP(A15,'[1]Zestawienie ilościowe i harmono'!$X$12:$AJ$30,3,0)","v":210.98},{"$error":"#VALUE!"},{"$f":"SUMIF('[1]Zestawienie ilościowe i harmono'!$X$12:$X$30,[1]MPKi!$A14,'[1]Zestawienie ilościowe i harmono'!$Z$12:$Z$30)","v":{"$error":"#VALUE!"}},{"$f":"IF('[1]Zestawienie ilościowe i harmono'!U14=[1]MPKi!C$7,[1]MPKi!J14,0)","v":0},null,104]
[139,{"$f":"VLOOKUP($A16,'[1]MPK-2023'!$A$3:$F$104,2,0)","v":"CSR Łabędzia - wspólne"},null,{"$f":"SUMIF('[1]Zestawienie ilościowe i harmono'!$X$12:$X$30,[1]MPKi!$A15,'[1]Zestawienie ilościowe i harmono'!$Z$12:$Z$30)","v":{"$error":"#VALUE!"}},null,null,{"$error":"#VALUE!"},null,{"$f":"VLOOKUP(A16,'[1]Zestawienie ilościowe i harmono'!$X$12:$AJ$30,3,0)","v":1093},{"$error":"#VALUE!"},{"$f":"SUMIF('[1]Zestawienie ilościowe i harmono'!$X$12:$X$30,[1]MPKi!$A15,'[1]Zestawienie ilościowe i harmono'!$Z$12:$Z$30)","v":{"$error":"#VALUE!"}},{"$f":"IF('[1]Zestawienie ilościowe i harmono'!U15=[1]MPKi!C$7,[1]MPKi!J15,0)","v":0},null,140]
[140,{"$f":"VLOOKUP($A17,'[1]MPK-2023'!$A$3:$F$104,2,0)","v":"Icemania"},null,null,{"$f":"SUMIF('[1]Zestawienie ilościowe i harmono'!$X$12:$X$30,[1]MPKi!$A16,'[1]Zestawienie ilościowe i harmono'!$Z$12:$Z$30)","v":{"$error":"#VALUE!"}},null,{"$error":"#VALUE!"},null,{"$f":"VLOOKUP(A17,'[1]Zestawienie ilościowe i harmono'!$X$12:$AJ$30,3,0)","v":275.85},{"$error":"#VALUE!"},{"$f":"SUMIF('[1]Zestawienie ilościowe i harmono'!$X$12:$X$30,[1]MPKi!$A16,'[1]Zestawienie ilościowe i harmono'!$Z$12:$Z$30)","v":{"$error":"#VALUE!"}},{"$f":"IF('[1]Zestawienie ilościowe i harmono'!U16=[1]MPKi!C$7,[1]MPKi!J16,0)","v":0},null,157]
[141,{"$f":"VLOOKUP($A18,'[1]MPK-2023'!$A$3:$F$104,2,0)","v":"Miasteczko Ruchu Drogowego"},null,null,{"$f":"SUMIF('[1]Zestawienie ilościowe i harmono'!$X$12:$X$30,[1]MPKi!$A17,'[1]Zestawienie ilościowe i harmono'!$Z$12:$Z$30)","v":{"$error":"#VALUE!"}},null,{"$error":"#VALUE!"},null,{"$f":"VLOOKUP(A18,'[1]Zestawienie ilościowe i harmono'!$X$12:$AJ$30,3,0)","v":33.54},{"$error":"#VALUE!"},{"$f":"SUMIF('[1]Zestawienie ilościowe i harmono'!$X$12:$X$30,[1]MPKi!$A17,'[1]Zestawienie ilościowe i harmono'!$Z$12:$Z$30)","v":{"$error":"#VALUE!"}},{"$f":"IF('[1]Zestawienie ilościowe i harmono'!U17=[1]MPKi!C$7,[1]MPKi!J17,0)","v":0},null,141]
[157,{"$f":"VLOOKUP($A19,'[1]MPK-2023'!$A$3:$F$104,2,0)","v":"Aqua Lublin - wspólne"},null,{"$f":"SUMIF('[1]Zestawienie ilościowe i harmono'!$X$12:$X$30,[1]MPKi!$A18,'[1]Zestawienie ilościowe i harmono'!$Z$12:$Z$30)","v":{"$error":"#VALUE!"}},null,null,{"$error":"#VALUE!"},null,{"$f":"VLOOKUP(A19,'[1]Zestawienie ilościowe i harmono'!$X$12:$AJ$30,3,0)","v":1401.73},{"$error":"#VALUE!"},{"$f":"SUMIF('[1]Zestawienie ilościowe i harmono'!$X$12:$X$30,[1]MPKi!$A18,'[1]Zestawienie ilościowe i harmono'!$Z$12:$Z$30)","v":{"$error":"#VALUE!"}},{"$f":"IF('[1]Zestawienie ilościowe i harmono'!U18=[1]MPKi!C$7,[1]MPKi!J18,0)","v":0},null,201]
[201,{"$f":"VLOOKUP($A20,'[1]MPK-2023'!$A$3:$F$104,2,0)","v":"Globus - hala "},null,null,{"$f":"SUMIF('[1]Zestawienie ilościowe i harmono'!$X$12:$X$30,[1]MPKi!$A19,'[1]Zestawienie ilościowe i harmono'!$Z$12:$Z$30)","v":{"$error":"#VALUE!"}},null,{"$error":"#VALUE!"},null,{"$f":"VLOOKUP(A20,'[1]Zestawienie ilościowe i harmono'!$X$12:$AJ$30,3,0)","v":3188},{"$error":"#VALUE!"},{"$f":"SUMIF('[1]Zestawienie ilościowe i harmono'!$X$12:$X$30,[1]MPKi!$A19,'[1]Zestawienie ilościowe i harmono'!$Z$12:$Z$30)","v":{"$error":"#VALUE!"}},{"$f":"IF('[1]Zestawienie ilościowe i harmono'!U19=[1]MPKi!C$7,[1]MPKi!J19,0)","v":0},null,290]
[290,{"$f":"VLOOKUP($A21,'[1]MPK-2023'!$A$3:$F$104,2,0)","v":"Globus - wspólne"},null,null,{"$f":"SUMIF('[1]Zestawienie ilościowe i harmono'!$X$12:$X$30,[1]MPKi!$A20,'[1]Zestawienie ilościowe i harmono'!$Z$12:$Z$30)","v":{"$error":"#VALUE!"}},null,{"$error":"#VALUE!"},null,{"$f":"VLOOKUP(A21,'[1]Zestawienie ilościowe i harmono'!$X$12:$AJ$30,3,0)","v":72.02},{"$error":"#VALUE!"},{"$f":"SUMIF('[1]Zestawienie ilościowe i harmono'!$X$12:$X$30,[1]MPKi!$A20,'[1]Zestawienie ilościowe i harmono'!$Z$12:$Z$30)","v":{"$error":"#VALUE!"}},{"$f":"IF('[1]Zestawienie ilościowe i harmono'!U20=[1]MPKi!C$7,[1]MPKi!J20,0)","v":0},null,910]
[301,{"$f":"VLOOKUP($A22,'[1]MPK-2023'!$A$3:$F$104,2,0)","v":"Zalew - budynki"},null,{"$f":"SUMIF('[1]Zestawienie ilościowe i harmono'!$X$12:$X$30,[1]MPKi!$A21,'[1]Zestawienie ilościowe i harmono'!$Z$12:$Z$30)","v":{"$error":"#VALUE!"}},null,null,{"$f":"SUM(C22:E22)","v":{"$error":"#VALUE!"}},null,{"$f":"VLOOKUP(A22,'[1]Zestawienie ilościowe i harmono'!$X$12:$AJ$30,3,0)","v":165.35},{"$error":"#VALUE!"},{"$f":"SUMIF('[1]Zestawienie ilościowe i harmono'!$X$12:$X$30,[1]MPKi!$A21,'[1]Zestawienie ilościowe i harmono'!$Z$12:$Z$30)","v":{"$error":"#VALUE!"}},{"$f":"IF('[1]Zestawienie ilościowe i harmono'!U21=[1]MPKi!C$7,[1]MPKi!J21,0)","v":0},null,301]
[320,{"$f":"VLOOKUP($A23,'[1]MPK-2023'!$A$3:$F$104,2,0)","v":"SW - baseny,teren eventowy"},null,{"$f":"SUMIF('[1]Zestawienie ilościowe i harmono'!$X$12:$X$30,[1]MPKi!$A22,'[1]Zestawienie ilościowe i harmono'!$Z$12:$Z$30)","v":{"$error":"#VALUE!"}},null,null,{"$f":"SUM(C23:E23)","v":{"$error":"#VALUE!"}},null,{"$f":"VLOOKUP(A23,'[1]Zestawienie ilościowe i harmono'!$X$12:$AJ$30,3,0)","v":112.57},{"$error":"#VALUE!"},{"$f":"SUMIF('[1]Zestawienie ilościowe i harmono'!$X$12:$X$30,[1]MPKi!$A22,'[1]Zestawienie ilościowe i harmono'!$Z$12:$Z$30)","v":{"$error":"#VALUE!"}},{"$f":"IF('[1]Zestawienie ilościowe i harmono'!U22=[1]MPKi!C$7,[1]MPKi!J22,0)","v":0},null,320]
[321,{"$f":"VLOOKUP($A24,'[1]MPK-2023'!$A$3:$F$104,2,0)","v":"SW - wypożyczalnia"},null,{"$f":"SUMIF('[1]Zestawienie ilościowe i harmono'!$X$12:$X$30,[1]MPKi!$A23,'[1]Zestawienie ilościowe i harmono'!$Z$12:$Z$30)","v":{"$error":"#VALUE!"}},null,null,{"$f":"SUM(C24:E24)","v":{"$error":"#VALUE!"}}]
[401,{"$f":"VLOOKUP($A25,'[1]MPK-2023'!$A$3:$F$104,2,0)","v":"Zygmuntowskie Stadion i Biurowiec"},{"$f":"SUMIF('[1]Zestawienie ilościowe i harmono'!$X$12:$X$30,[1]MPKi!$A24,'[1]Zestawienie ilościowe i harmono'!$Z$12:$Z$30)","v":{"$error":"#VALUE!"}},{"$nulls":3},{"$f":"SUM(C25:F25)","v":{"$error":"#VALUE!"}},null,{"$f":"VLOOKUP(A25,'[1]Zestawienie ilościowe i harmono'!$X$12:$AJ$30,3,0)","v":405.31},{"$f":"G25-I25","v":{"$error":"#VALUE!"}},{"$f":"SUMIF('[1]Zestawienie ilościowe i harmono'!$X$12:$X$30,[1]MPKi!$A24,'[1]Zestawienie ilościowe i harmono'!$Z$12:$Z$30)","v":{"$error":"#VALUE!"}},{"$f":"IF('[1]Zestawienie ilościowe i harmono'!U24=[1]MPKi!C$7,[1]MPKi!J24,0)","v":0},null,410]
[403,{"$f":"VLOOKUP($A26,'[1]MPK-2023'!$A$3:$F$104,2,0)","v":"Piłsudskiego - sala gimnastyczna"},{"$f":"SUMIF('[1]Zestawienie ilościowe i harmono'!$X$12:$X$30,[1]MPKi!$A25,'[1]Zestawienie ilościowe i harmono'!$Z$12:$Z$30)","v":{"$error":"#VALUE!"}},{"$nulls":3},{"$error":"#VALUE!"},null,{"$f":"VLOOKUP(A26,'[1]Zestawienie ilościowe i harmono'!$X$12:$AJ$30,3,0)","v":220.66},{"$error":"#VALUE!"},{"$f":"SUMIF('[1]Zestawienie ilościowe i harmono'!$X$12:$X$30,[1]MPKi!$A25,'[1]Zestawienie ilościowe i harmono'!$Z$12:$Z$30)","v":{"$error":"#VALUE!"}},{"$f":"IF('[1]Zestawienie ilościowe i harmono'!U25=[1]MPKi!C$7,[1]MPKi!J25,0)","v":0},null,421]
[405,{"$f":"VLOOKUP($A27,'[1]MPK-2023'!$A$3:$F$104,2,0)","v":"Piłsudskiego - stadion lekkoatletyczny"},{"$f":"SUMIF('[1]Zestawienie ilościowe i harmono'!$X$12:$X$30,[1]MPKi!$A26,'[1]Zestawienie ilościowe i harmono'!$Z$12:$Z$30)","v":{"$error":"#VALUE!"}},{"$nulls":3},{"$error":"#VALUE!"},null,{"$f":"VLOOKUP(A27,'[1]Zestawienie ilościowe i harmono'!$X$12:$AJ$30,3,0)","v":513.98},{"$error":"#VALUE!"},{"$f":"SUMIF('[1]Zestawienie ilościowe i harmono'!$X$12:$X$30,[1]MPKi!$A26,'[1]Zestawienie ilościowe i harmono'!$Z$12:$Z$30)","v":{"$error":"#VALUE!"}},{"$f":"IF('[1]Zestawienie ilościowe i harmono'!U26=[1]MPKi!C$7,[1]MPKi!J26,0)","v":0},null,401]
[410,{"$f":"VLOOKUP($A28,'[1]MPK-2023'!$A$3:$F$104,2,0)","v":"Kresowa - stadion "},{"$f":"SUMIF('[1]Zestawienie ilościowe i harmono'!$X$12:$X$30,[1]MPKi!$A27,'[1]Zestawienie ilościowe i harmono'!$Z$12:$Z$30)","v":{"$error":"#VALUE!"}},{"$nulls":3},{"$error":"#VALUE!"},null,{"$f":"VLOOKUP(A28,'[1]Zestawienie ilościowe i harmono'!$X$12:$AJ$30,3,0)","v":40.69},{"$error":"#VALUE!"},{"$f":"SUMIF('[1]Zestawienie ilościowe i harmono'!$X$12:$X$30,[1]MPKi!$A27,'[1]Zestawienie ilościowe i harmono'!$Z$12:$Z$30)","v":{"$error":"#VALUE!"}},{"$f":"IF('[1]Zestawienie ilościowe i harmono'!U27=[1]MPKi!C$7,[1]MPKi!J27,0)","v":0},null,403]
[421,{"$f":"VLOOKUP($A29,'[1]MPK-2023'!$A$3:$F$104,2,0)","v":"Lublinianka - biura"},null,null,{"$f":"SUMIF('[1]Zestawienie ilościowe i harmono'!$X$12:$X$30,[1]MPKi!$A28,'[1]Zestawienie ilościowe i harmono'!$Z$12:$Z$30)","v":{"$error":"#VALUE!"}},null,{"$error":"#VALUE!"},null,{"$f":"VLOOKUP(A29,'[1]Zestawienie ilościowe i harmono'!$X$12:$AJ$30,3,0)","v":259.34},{"$error":"#VALUE!"},{"$f":"SUMIF('[1]Zestawienie ilościowe i harmono'!$X$12:$X$30,[1]MPKi!$A28,'[1]Zestawienie ilościowe i harmono'!$Z$12:$Z$30)","v":{"$error":"#VALUE!"}},{"$f":"IF('[1]Zestawienie ilościowe i harmono'!U28=[1]MPKi!C$7,[1]MPKi!J28,0)","v":0},null,405]
[590,{"$f":"VLOOKUP($A30,'[1]MPK-2023'!$A$3:$F$104,2,0)","v":"Arena Lublin - wspólne"},{"$f":"SUMIF('[1]Zestawienie ilościowe i harmono'!$X$12:$X$30,[1]MPKi!$A29,'[1]Zestawienie ilościowe i harmono'!$Z$12:$Z$30)","v":{"$error":"#VALUE!"}},{"$nulls":3},{"$error":"#VALUE!"},null,{"$f":"VLOOKUP(A30,'[1]Zestawienie ilościowe i harmono'!$X$12:$AJ$30,3,0)","v":1856.74},{"$error":"#VALUE!"},{"$f":"SUMIF('[1]Zestawienie ilościowe i harmono'!$X$12:$X$30,[1]MPKi!$A29,'[1]Zestawienie ilościowe i harmono'!$Z$12:$Z$30)","v":{"$error":"#VALUE!"}},{"$f":"IF('[1]Zestawienie ilościowe i harmono'!U29=[1]MPKi!C$7,[1]MPKi!J29,0)","v":0},null,139]
{"$rows_left_out":42}
{"sheet":"Zad__5 - Przep ECOL-UNICON","index":5,"n_rows":21,"n_cols":12,"rows_kept":21,"merged":[[0,10,0,11],[2,0,2,11],[3,0,3,11],[5,0,6,0],[5,1,6,1],[5,2,6,2],[5,3,6,4],[13,9,13,10],[14,1,14,6],[15,1,15,6],[17,1,17,6],[19,8,19,11],[20,8,22,11]]}
[null,"ZZP.260.2.15.2023",{"$nulls":8},"Załącznik nr 3.5"]
[]
["Wykonanie przeglądów serwisowych hydroforowych zestawów pompowych i przepompowni ścieków w obiektach MOSiR w latach 2022-2025"]
[]
[null,"Kosztorys ofertowy"]
["L.p.","Nazwa / typ\nUkładu / urządzenia","Producent","Lokalizacja",null,"Status urządzenia","Harmonogram1)","j.m.","Ilość","Częstotliwość usługi w okresie Umowy 2)","Cena jednostkowa brutto","Wartość brutto [zł]"]
[{"$nulls":8},"a","b","c","a*b*c"]
["1","2","3","4","5","6","7","8","9","10","11","12"]
["1.","Przepompownia ścieków deszczowych Ecol-Unicon P1\n Ø1500, H=3,78m, EPS DN100, \nPompy:\nSLV.80.80.11.4.50 D, 1,5kW – 2 szt, sterownik MT-151 z panelem Astraada AS44TFT0422, ZP 164828","Grundfoss","AQUA Lublin\n\nAl. Zygmuntowskie 4","Plac centralny (pomiędzy Hala Sprtową im. Niedzieli a A budynkiem AQUA Lublin","po gwarancji","1 - grudzień 2023\n2 - grudzień 2024\n3 - grudzień 2025","kpl",1,3]
["1a.","+ dostawa i wymiana sondy hydrostatycznej oraz zasilacz",{"$nulls":4},"1 - grudzień 2023","kpl",1,1]
["1b.","+ wymiana ojelu w pompach ",{"$nulls":4},"1 - grudzień 2023\n2 - grudzień 2024\n3 - grudzień 2025","kpl",1,3]
["2.","Przepompownia ścieków deszczowych Ecol-Unicon P2 \nØ1500, H=6,83m, EPS DN150, \nPompy\nSE1.80.100.22.4.50 D , 2,9/2,2kW – 2 szt, sterownik MT-151 z panelem Astraada AS44TFT0422, ZP 170245","Grundfoss","AQUA Lublin\n\nAl. Zygmuntowskie 4","Plac manewrowy od strony MRD, strona zachodnia kompleksu.","po gwarancji","1 - grudzień 2023\n2 - grudzień 2024\n3 - grudzień 2025","kpl",1,3]
["2.","+ wymiana ojelu w pompach ",{"$nulls":4},"1 - grudzień 2023\n2 - grudzień 2024\n3 - grudzień 2025","kpl",1,3]
[{"$nulls":9},"RAZEM BRUTTO:"]
[null,"1) TERMIN WYKONANIA USŁUGI:"]
[null,"   - maksymalny ustalony wg terminu poprzedniego serwisu – należy wykonać nie później niż podana data i wcześniej niż 14 dni przed, chyba że   uzgodniono inaczej z Zamawiającym."]
[null,"2) częstotliwość usług w zakresie umowy:"]
[null,"   - w tym przeglądy dodatkowe"]
[]
[{"$nulls":8},"…....................................…….............................."]
[{"$nulls":8},"(Podpis i pieczęć imienna osób uprawnionych do składania oświadczeń woli Wykonawcy)"]